Matt Menzenski
12/09/2022, 8:55 PMMatt Menzenski
12/09/2022, 8:55 PMMatt Menzenski
12/09/2022, 9:00 PMMatt Menzenski
12/09/2022, 9:01 PMpoetry shell followed by pytest or just poetry run pytestWill Da Silva (Arch)
12/09/2022, 10:31 PMdocker-compose installed?Will Da Silva (Arch)
12/09/2022, 10:32 PMMatt Menzenski
12/09/2022, 10:32 PMWill Da Silva (Arch)
12/09/2022, 10:36 PMcd tests/fixtures/docker
docker-compose up --force-recreate snowplowMatt Menzenski
12/09/2022, 10:37 PM$ docker-compose up --force-recreate
Creating network "docker_default" with the default driver
Creating docker_snowplow_1 ... done
Attaching to docker_snowplow_1
snowplow_1 |
snowplow_1 | No java installations was detected.
snowplow_1 | Please go to <http://www.java.com/getjava/> and download
snowplow_1 |
docker_snowplow_1 exited with code 1Matt Menzenski
12/09/2022, 10:37 PMMatt Menzenski
12/09/2022, 10:37 PMWill Da Silva (Arch)
12/09/2022, 10:39 PMWill Da Silva (Arch)
12/09/2022, 10:39 PMwhich java, you get a path to a Java executable, right?Matt Menzenski
12/09/2022, 10:39 PM/usr/bin/javaWill Da Silva (Arch)
12/09/2022, 10:41 PMtests/fixtures/docker/snowplow.py such that the first line of the snowplow_session function is return None, that should fix the problem.Will Da Silva (Arch)
12/09/2022, 10:42 PMdocker-compose, not if the container can actually start.Will Da Silva (Arch)
12/09/2022, 10:50 PMMatt Menzenski
12/09/2022, 10:54 PMWill Da Silva (Arch)
12/09/2022, 10:54 PMMatt Menzenski
12/09/2022, 10:54 PMsnowplow_session function body with yield None, all tests run sucessfullyMatt Menzenski
12/12/2022, 2:49 PMazure :
ERROR tests/meltano/core/state_store/test_filesystem.py - ModuleNotFoundError: No module named 'azure'
ERROR tests/meltano/core/state_store/test_filesystem.py - ModuleNotFoundError: No module named 'azure'
ERROR tests/meltano/core/state_store/test_filesystem.py - ModuleNotFoundError: No module named 'azure'
ERROR tests/meltano/core/state_store/test_filesystem.py - ModuleNotFoundError: No module named 'azure'
ERROR tests/meltano/core/state_store/test_filesystem.py
ERROR tests/meltano/core/state_store/test_filesystem.py - ModuleNotFoundError: No module named 'azure'
ERROR tests/meltano/core/state_store/test_filesystem.py - ModuleNotFoundError: No module named 'azure'
ERROR tests/meltano/core/state_store/test_filesystem.py - ModuleNotFoundError: No module named 'azure'
ERROR tests/meltano/core/state_store/test_filesystem.py - ModuleNotFoundError: No module named 'azure'
FAILED tests/meltano/core/tracking/test_exception.py::test_complex_exception_context - AssertionError: assert '07d2ff4730eb...7f13790e2a65d' == '8604732e6dd0...79a0b758155d0'Will Da Silva (Arch)
12/12/2022, 2:49 PMpoetry install --all-extrasMatt Menzenski
12/12/2022, 2:50 PMMatt Menzenski
12/12/2022, 2:58 PMFAILED tests/meltano/core/tracking/test_exception.py::test_complex_exception_context - AssertionError: assert '07d2ff4730eb...7f13790e2a65d' == '8604732e6dd0...79a0b758155d0'Will Da Silva (Arch)
12/12/2022, 3:08 PMmain?Matt Menzenski
12/12/2022, 3:24 PMpyenv install 3.9.11Will Da Silva (Arch)
12/12/2022, 7:15 PMWill Da Silva (Arch)
12/12/2022, 10:03 PM